{"text_format":"1","workbook":"xlsx","n_sheets":3,"sheets":["キャラクターシート","武器","車両"],"not_rendered":{"charts":0,"images":0,"macros":0,"external_links":0,"defined_names":1,"comments":0,"pivot_tables":0},"unopened":[],"bounds":{"document_bytes":16777216,"sheet_cells":100000,"rows_first":2000,"rows_last":500,"rows_between":2000,"halvings":0,"cell_chars":16384,"cell_head_chars":4096},"cells_cut":0,"cells_raw":0,"read":"whole","date_system":"1900"}

{"sheet":"キャラクターシート","index":0,"n_rows":62,"n_cols":73,"rows_kept":62,"cut":false,"hidden":false,"merged":[[21,11,22,14],[21,15,22,16],[21,17,22,18],[20,0,20,18],[21,19,22,20],[21,21,22,22],[20,19,20,36],[38,72,38,73],[39,72,39,73],[33,44,34,45],[35,44,35,45],[36,27,36,34],[36,35,36,36],[27,1,27,4],[28,5,28,6],[34,0,34,4],[35,1,35,4],[34,5,34,6],[35,5,35,6],[21,31,22,32],[24,2,24,6],[29,16,29,17],[30,16,30,17],[25,14,25,15],[40,72,40,73],[41,72,41,73],[41,70,41,71],[12,0,13,2],[12,3,13,4],[12,5,13,6],[12,7,13,8],[21,0,22,2],[21,3,22,4],[18,27,18,30],[18,31,18,33],[35,70,35,71],[39,70,39,71],[37,70,37,71],[40,46,40,48],[41,46,41,48],[35,49,35,50],[36,49,36,50],[37,49,37,50],[38,49,38,50],[39,49,39,50],[41,49,41,50],[41,55,41,56],[39,53,39,54],[4,72,5,73],[6,72,7,73],[5,49,5,50],[5,51,5,52],[4,43,4,48],[6,49,7,50],[6,51,7,52],[4,53,5,54],[4,55,5,56],[4,65,5,66],[6,65,7,66],[4,59,5,60],[4,61,5,62],[6,61,7,62],[42,0,45,0],[45,9,46,9],[42,1,42,4],[47,7,47,8],[43,1,43,4],[44,1,44,4],[49,7,49,8],[41,9,43,9],[45,7,45,8],[46,7,46,8],[48,1,48,4],[46,5,46,6],[45,5,45,6],[49,1,49,4],[48,5,48,6],[48,7,48,8],[41,0,41,4],[47,5,47,6],[46,0,46,4],[47,1,47,4],[44,5,44,6],[42,5,42,6],[49,5,49,6],[48,9,49,9],[35,63,35,64],[36,57,36,58],[35,65,35,67],[39,55,39,56],[40,55,40,56],[41,59,41,60],[41,61,41,62],[41,63,41,64],[41,53,41,54],[40,65,40,67],[41,65,41,67],[38,63,38,64],[39,57,39,58],[39,59,39,60],[39,61,39,62],[39,63,39,64],[40,57,40,58],[40,59,40,60],[40,61,40,62],[40,63,40,64],[44,7,44,8],[42,7,42,8],[38,5,38,6],[43,7,43,8],[38,7,38,8],[43,5,43,6],[50,9,50,13],[49,16,49,17],[44,18,44,22],[45,18,45,22],[41,5,41,6],[41,7,41,8],[38,10,38,13],[38,9,39,9],[39,10,39,13],[39,5,39,6],[39,7,39,8],[51,0,53,0],[51,1,51,4],[52,1,52,4],[53,1,53,4],[51,5,51,6],[51,7,51,8],[52,5,52,6],[52,7,52,8],[53,5,53,6],[53,7,53,8],[37,35,37,36],[33,27,33,34],[39,27,39,34],[39,35,39,36],[38,27,38,34],[38,35,38,36],[43,35,43,36],[42,27,42,34],[37,27,37,34],[35,27,35,34],[47,50,47,51],[47,52,47,53],[47,54,47,55],[47,56,47,63],[42,49,42,50],[42,51,42,52],[49,34,49,36],[50,34,50,36],[50,29,50,31],[50,32,50,33],[49,32,49,33],[50,18,50,25],[51,18,51,25],[53,32,53,33],[49,10,49,13],[51,34,51,36],[52,31,52,34],[52,35,52,36],[46,37,46,45],[47,37,47,45],[51,32,51,33],[57,20,57,27],[33,51,34,52],[33,46,34,48],[36,51,36,52],[37,51,37,52],[38,51,38,52],[39,51,39,52],[39,46,39,48],[39,44,39,45],[40,44,40,45],[41,44,41,45],[42,44,42,45],[56,0,56,36],[50,26,50,28],[51,29,51,31],[57,16,58,17],[47,18,47,22],[42,35,42,36],[40,27,40,34],[40,35,40,36],[46,18,46,22],[43,27,43,34],[46,10,46,13],[49,18,49,25],[59,24,59,25],[59,22,59,23],[59,20,59,21],[59,18,59,19],[47,9,47,13],[57,7,58,8],[50,0,50,4],[50,5,50,6],[50,7,50,8],[54,0,54,4],[54,5,54,6],[54,7,54,8],[55,0,55,4],[55,5,55,6],[55,7,55,8],[47,16,47,17],[48,16,48,17],[57,0,58,6],[47,0,49,0],[48,14,48,15],[48,10,48,13],[57,12,58,13],[57,14,58,15],[57,9,58,11],[60,30,60,31],[61,30,61,31],[60,26,60,27],[61,18,61,19],[59,32,59,36],[59,26,59,27],[60,0,60,6],[61,16,61,17],[61,0,61,6],[59,12,59,13],[59,14,59,15],[60,12,60,13],[60,14,60,15],[61,12,61,13],[61,14,61,15],[59,7,59,8],[59,9,59,11],[61,7,61,8],[59,16,59,17],[60,16,60,17],[59,0,59,6],[60,7,60,8],[61,9,61,11],[60,9,60,11],[61,20,61,21],[57,18,58,19],[61,22,61,23],[61,24,61,25],[61,26,61,27],[60,20,60,21],[55,26,55,28],[54,34,54,36],[44,23,44,24],[44,25,44,26],[45,23,45,24],[45,25,45,26],[46,23,46,24],[46,25,46,26],[47,23,47,24],[47,25,47,26],[46,27,47,36],[53,34,53,36],[52,18,52,28],[51,26,51,28],[48,18,48,36],[61,32,61,36],[55,32,55,33],[61,28,61,29],[58,20,58,21],[58,22,58,23],[58,24,58,25],[58,26,58,27],[53,29,53,31],[54,29,54,31],[60,32,60,36],[60,22,60,23],[60,24,60,25],[53,18,53,25],[54,18,54,25],[55,34,55,36],[54,32,54,33],[57,32,58,36],[55,18,55,25],[53,26,53,28],[54,26,54,28],[55,29,55,31],[60,28,60,29],[57,28,58,29],[60,18,60,19],[59,28,59,29],[57,30,58,31],[59,30,59,31],[26,14,26,15],[24,18,24,19],[25,16,25,17],[25,18,25,22],[31,16,31,17],[32,16,32,17],[34,14,34,15],[34,16,34,17],[28,1,28,4],[26,0,26,4],[25,0,25,4],[25,5,25,6],[25,7,25,8],[26,5,26,6],[26,7,26,8],[26,9,26,13],[35,0,37,0],[28,14,28,15],[27,16,27,17],[28,16,28,17],[29,14,29,15],[32,7,32,8],[33,16,33,17],[33,14,33,15],[31,14,31,15],[27,9,28,9],[29,7,29,8],[37,9,37,13],[30,10,30,13],[30,9,32,9],[31,10,31,13],[32,10,32,13],[36,7,36,8],[32,5,32,6],[35,7,35,8],[37,7,37,8],[33,9,33,13],[37,5,37,6],[39,0,40,0],[39,1,39,4],[40,1,40,4],[28,7,28,8],[29,5,29,6],[40,9,40,13],[27,10,27,13],[28,10,28,13],[29,9,29,13],[40,5,40,6],[40,7,40,8],[34,10,34,13],[34,9,36,9],[35,10,35,13],[36,10,36,13],[37,1,37,4],[33,5,33,6],[33,7,33,8],[34,7,34,8],[30,5,30,6],[30,7,30,8],[36,1,36,4],[38,0,38,4],[36,5,36,6],[33,37,34,43],[35,37,35,43],[36,37,36,43],[37,37,37,43],[37,44,37,45],[38,37,38,43],[24,16,24,17],[45,1,45,4],[46,16,46,17],[45,10,45,13],[45,16,45,17],[46,14,46,15],[42,16,42,17],[44,16,44,17],[41,10,41,13],[42,10,42,13],[43,10,43,13],[43,14,43,15],[43,16,43,17],[44,14,44,15],[41,14,41,15],[29,1,29,4],[27,5,27,6],[27,7,27,8],[33,49,34,50],[35,51,35,52],[34,63,34,64],[34,61,34,62],[34,59,34,60],[34,57,34,58],[33,57,33,64],[38,44,38,45],[35,46,35,48],[36,46,36,48],[38,53,38,54],[37,46,37,48],[38,46,38,48],[33,53,34,54],[35,53,35,54],[36,53,36,54],[37,53,37,54],[33,55,34,56],[37,55,37,56],[38,55,38,56],[37,63,37,64],[38,57,38,58],[38,59,38,60],[38,61,38,62],[26,35,26,36],[35,35,35,36],[28,35,28,36],[30,27,30,34],[29,27,29,34],[29,35,29,36],[30,35,30,36],[31,27,31,34],[31,35,31,36],[32,27,32,34],[32,35,32,36],[27,27,27,34],[34,27,34,34],[26,27,26,34],[33,35,33,36],[34,35,34,36],[2,31,3,36],[2,28,3,30],[2,19,3,27],[4,19,5,20],[13,19,13,26],[14,27,14,30],[4,34,5,36],[4,21,5,30],[8,27,8,30],[11,27,11,30],[11,31,11,33],[9,27,9,30],[9,31,9,33],[9,34,9,36],[13,27,13,30],[13,31,13,33],[10,34,10,36],[12,31,12,33],[12,34,12,36],[21,79,21,86],[6,59,7,60],[2,67,3,73],[9,55,9,56],[4,57,5,58],[6,57,7,58],[4,63,5,64],[6,63,7,64],[33,70,34,71],[6,55,7,56],[4,69,5,71],[6,69,7,71],[4,67,5,68],[6,67,7,68],[8,55,8,60],[9,59,9,60],[10,59,11,60],[9,57,9,58],[10,57,11,58],[10,55,11,56],[10,68,11,69],[10,70,11,71],[10,72,11,73],[2,64,3,66],[42,53,42,54],[43,53,43,54],[33,72,34,73],[35,72,35,73],[36,72,36,73],[37,72,37,73],[46,54,46,55],[35,57,35,58],[35,59,35,60],[35,61,35,62],[40,70,40,71],[38,70,38,71],[36,70,36,71],[36,65,36,67],[37,65,37,67],[38,65,38,67],[39,65,39,67],[43,72,43,73],[43,65,43,67],[43,55,43,56],[42,55,42,56],[40,53,40,54],[35,55,35,56],[36,55,36,56],[61,68,61,69],[61,70,61,71],[61,72,61,73],[60,37,60,45],[60,46,60,47],[60,48,60,49],[60,50,60,51],[60,52,60,53],[60,54,60,55],[60,56,60,63],[60,64,60,65],[60,66,60,67],[61,37,61,45],[61,46,61,47],[61,48,61,49],[61,50,61,51],[61,52,61,53],[61,54,61,55],[61,56,61,63],[61,64,61,65],[61,66,61,67],[60,68,60,69],[60,70,60,71],[60,72,60,73],[59,70,59,71],[59,72,59,73],[58,37,58,45],[58,46,58,47],[58,48,58,49],[58,50,58,51],[58,52,58,53],[58,54,58,55],[58,56,58,63],[58,64,58,65],[58,66,58,67],[58,68,58,69],[58,70,58,71],[58,72,58,73],[59,37,59,45],[59,46,59,47],[59,48,59,49],[59,50,59,51],[59,52,59,53],[59,54,59,55],[59,56,59,63],[59,64,59,65],[59,66,59,67],[59,68,59,69],[56,68,56,69],[56,70,56,71],[56,72,56,73],[57,37,57,45],[57,46,57,47],[57,48,57,49],[57,50,57,51],[57,52,57,53],[57,54,57,55],[57,56,57,63],[57,64,57,65],[57,66,57,67],[57,68,57,69],[57,70,57,71],[57,72,57,73],[56,37,56,45],[56,46,56,47],[56,48,56,49],[56,50,56,51],[56,52,56,53],[56,54,56,55],[56,56,56,63],[56,64,56,65],[56,66,56,67],[54,68,54,69],[54,70,54,71],[54,72,54,73],[55,37,55,45],[55,46,55,47],[55,48,55,49],[55,50,55,51],[55,52,55,53],[55,54,55,55],[55,56,55,63],[55,64,55,65],[55,66,55,67],[55,68,55,69],[55,70,55,71],[55,72,55,73],[54,37,54,45],[54,46,54,47],[54,48,54,49],[54,50,54,51],[54,52,54,53],[54,54,54,55],[54,56,54,63],[54,64,54,65],[54,66,54,67],[52,68,52,69],[52,70,52,71],[52,72,52,73],[53,37,53,45],[53,46,53,47],[53,48,53,49],[53,50,53,51],[53,52,53,53],[53,54,53,55],[53,56,53,63],[53,64,53,65],[53,66,53,67],[53,68,53,69],[53,70,53,71],[53,72,53,73],[52,37,52,45],[52,46,52,47],[52,48,52,49],[52,50,52,51],[52,52,52,53],[52,54,52,55],[52,56,52,63],[52,64,52,65],[52,66,52,67],[51,68,51,69],[51,70,51,71],[51,72,51,73],[50,37,50,45],[50,46,50,47],[50,48,50,49],[50,50,50,51],[50,52,50,53],[50,54,50,55],[50,56,50,63],[50,64,50,65],[50,66,50,67],[51,37,51,45],[51,46,51,47],[51,48,51,49],[51,50,51,51],[51,52,51,53],[51,54,51,55],[51,56,51,63],[51,64,51,65],[51,66,51,67],[50,68,50,69],[50,70,50,71],[50,72,50,73],[49,68,49,69],[49,70,49,71],[49,72,49,73],[48,37,48,45],[48,46,48,47],[48,48,48,49],[48,50,48,51],[48,52,48,53],[48,54,48,55],[48,56,48,63],[48,64,48,65],[48,66,48,67],[48,68,48,69],[48,70,48,71],[49,37,49,45],[49,46,49,47],[49,48,49,49],[49,50,49,51],[49,52,49,53],[49,54,49,55],[49,56,49,63],[49,64,49,65],[49,66,49,67],[48,72,48,73],[47,64,47,65],[47,66,47,67],[43,49,43,50],[43,51,43,52],[46,46,46,47],[46,48,46,49],[46,50,46,51],[46,52,46,53],[47,72,47,73],[47,68,47,69],[47,70,47,71],[46,64,46,65],[46,66,46,67],[46,68,46,69],[46,70,46,71],[43,57,43,58],[43,59,43,60],[43,61,43,62],[43,63,43,64],[46,72,46,73],[46,56,46,63],[43,70,43,71],[47,46,47,47],[47,48,47,49],[40,49,40,50],[36,44,36,45],[40,51,40,52],[0,37,1,73],[44,9,44,13],[0,0,1,36],[30,0,30,4],[31,1,31,4],[32,1,32,4],[33,1,33,4],[31,0,33,0],[24,7,24,8],[24,0,24,1],[2,37,3,40],[44,37,45,73],[27,0,29,0],[42,72,42,73],[42,70,42,71],[42,46,42,48],[42,14,42,15],[44,27,45,36],[41,51,41,52],[43,44,43,45],[43,46,43,48],[42,65,42,67],[17,34,17,36],[4,31,5,33],[19,19,19,26],[27,35,27,36],[28,27,28,34],[33,19,33,22],[33,23,33,24],[43,23,43,24],[43,25,43,26],[43,18,43,22],[17,27,17,30],[30,25,30,26],[31,25,31,26],[32,25,32,26],[32,19,32,22],[29,25,29,26],[21,25,22,26],[21,27,22,28],[21,29,22,30],[21,33,22,34],[29,23,29,24],[28,19,28,22],[29,19,29,22],[8,7,9,8],[21,35,22,36],[4,0,5,3],[4,17,5,18],[7,3,7,4],[4,15,5,16],[26,16,26,17],[16,19,16,26],[17,19,17,26],[18,19,18,26],[14,19,14,26],[8,19,8,26],[9,19,9,26],[12,19,12,26],[10,19,10,26],[11,19,11,26],[26,18,26,22],[25,9,25,13],[26,23,26,24],[6,19,7,36],[14,7,15,8],[8,3,9,4],[14,5,15,6],[18,3,19,4],[18,5,19,6],[2,0,3,3],[2,4,3,14],[24,11,24,15],[24,9,24,10],[21,5,22,6],[21,23,22,24],[21,7,22,8],[21,9,22,10],[10,5,11,6],[18,7,19,8],[10,3,11,4],[14,3,15,4],[10,7,11,8],[2,15,3,18],[4,4,5,10],[4,11,5,12],[4,13,5,14],[10,0,11,2],[14,0,15,2],[16,0,17,2],[16,5,17,6],[6,0,6,8],[7,7,7,8],[7,5,7,6],[8,5,9,6],[16,7,17,8],[16,3,17,4],[8,0,9,2],[18,0,19,2],[25,23,25,24],[47,14,47,15],[49,14,49,15],[45,14,45,15],[35,14,35,15],[40,14,40,15],[40,16,40,17],[41,16,41,17],[39,16,39,17],[36,16,36,17],[37,16,37,17],[38,14,38,15],[38,16,38,17],[39,14,39,15],[37,14,37,15],[35,16,35,17],[36,14,36,15],[30,23,30,24],[27,23,27,24],[27,14,27,15],[32,14,32,15],[8,34,8,36],[15,27,15,30],[31,5,31,6],[31,7,31,8],[28,23,28,24],[30,18,30,22],[31,19,31,22],[31,18,33,18],[33,25,33,26],[32,23,32,24],[30,14,30,15],[25,25,25,26],[24,25,24,26],[24,20,24,24],[19,27,19,30],[16,27,16,30],[13,34,13,36],[11,34,11,36],[12,27,12,30],[10,27,10,30],[10,31,10,33],[24,35,24,36],[16,31,16,33],[16,34,16,36],[17,31,17,33],[24,27,24,34],[18,34,18,36],[19,31,19,33],[19,34,19,36],[25,27,25,34],[25,35,25,36],[31,37,32,73],[8,31,8,33],[14,31,14,33],[14,34,14,36],[15,31,15,33],[49,29,49,31],[49,26,49,28],[41,18,42,26],[41,27,41,34],[41,35,41,36],[23,27,23,36],[23,0,23,26],[15,34,15,36],[15,19,15,26],[27,25,27,26],[31,23,31,24],[26,25,26,26],[28,25,28,26],[27,19,27,22],[27,18,29,18],[42,57,42,58],[42,59,42,60],[42,61,42,62],[42,63,42,64],[39,37,39,43],[40,37,40,43],[41,37,41,43],[42,37,42,43],[43,37,43,43],[33,65,33,69],[34,65,34,67],[34,68,34,69],[43,68,43,69],[35,68,35,69],[36,68,36,69],[37,68,37,69],[38,68,38,69],[39,68,39,69],[40,68,40,69],[41,68,41,69],[42,68,42,69],[36,59,36,60],[36,61,36,62],[36,63,36,64],[37,57,37,58],[37,59,37,60],[37,61,37,62],[41,57,41,58],[10,66,11,67],[8,53,9,54],[10,53,11,54],[8,64,9,73],[4,37,5,42],[10,40,10,42],[11,40,11,42],[9,40,9,42],[9,37,9,39],[10,43,10,44],[11,43,11,44],[10,45,10,46],[10,47,10,48],[10,49,10,50],[10,51,10,52],[11,45,11,46],[11,47,11,48],[6,37,7,42],[11,49,11,50],[11,51,11,52],[9,43,9,52],[8,37,8,52],[10,37,10,39],[11,37,11,39],[2,52,3,54],[2,55,3,60],[2,61,2,63],[3,61,3,63],[8,61,9,63],[10,61,11,63],[10,64,11,65],[2,41,3,51],[6,53,7,54],[5,43,5,44],[6,43,7,44],[5,45,5,46],[6,45,7,46],[5,47,5,48],[6,47,7,48],[4,49,4,52],[13,42,14,43],[14,40,14,41],[15,40,15,41],[16,40,16,41],[17,40,17,41],[18,40,18,41],[19,40,19,41],[20,40,20,41],[21,42,21,43],[21,40,21,41],[13,38,13,41],[15,42,15,43],[16,42,16,43],[17,42,17,43],[18,42,18,43],[19,42,19,43],[20,42,20,43],[22,42,22,43],[23,42,23,43],[24,42,24,43],[25,42,25,43],[26,42,26,43],[27,42,27,43],[28,42,28,43],[29,42,29,43],[22,40,22,41],[23,40,23,41],[24,40,24,41],[25,40,25,41],[26,40,26,41],[27,40,27,41],[28,40,28,41],[29,40,29,41],[23,38,23,39],[24,38,24,39],[25,38,25,39],[26,38,26,39],[27,38,27,39],[28,38,28,39],[29,38,29,39],[14,38,14,39],[15,38,15,39],[16,38,16,39],[17,38,17,39],[18,38,18,39],[19,38,19,39],[20,38,20,39],[21,38,21,39],[22,38,22,39],[54,9,54,13],[55,9,55,13],[53,14,53,15],[53,16,53,17],[54,14,54,15],[54,16,54,17],[55,14,55,15],[55,16,55,17],[50,14,50,15],[50,16,50,17],[51,9,51,13],[51,14,51,15],[52,14,52,15],[51,16,51,17],[52,9,52,13],[52,16,52,17],[53,9,53,13]]}
["Armored　Trader　Character　Recored　Sheet　(ver9)",null,null,null,null,null,null,null,null,null,null,null,null,null,null,null,null,null,null,null,null,null,null,null,null,null,null,null,null,null,null,null,null,null,null,null,null,"Armored　Trader　vehicle　Recored　Sheet　(ver9)"]
[]
["キャラクター名",null,null,null,null,null,null,null,null,null,null,null,null,null,null,"プレイヤー名",null,null,null,null,null,null,null,null,null,null,null,null,"GM名",null,null,null,null,null,null,null,null,"車輌名",null,null,null,null,null,null,null,null,null,null,null,null,null,null,"操縦手",null,null,null,null,null,null,null,null,"運転技能",null,null,"所有者"]
[]
["クラス",null,null,null,null,null,null,null,null,null,null,"年齢",null,null,null,"性別",null,null,null,"外見",null,null,null,null,null,null,null,null,null,null,null,"経験値",null,null,null,null,null,"車種名",null,null,null,null,null,"速度性能",null,null,null,null,null,"操縦性能",null,null,null,"燃費\nkm/l",null,"燃料\n搭載",null,"燃料\n残量",null,"積載\n容量",null,"積載\n重量",null,"搭乗\n員数",null,"乗員\n遮蔽",null,"整備性",null,"電子的\n脆弱性",null,null,"自動\n操縦"]
[null,null,null,null,null,null,null,null,null,null,null,null,null,null,null,null,null,null,null,null,null,null,null,null,null,null,null,null,null,null,null,null,null,null,null,null,null,null,null,null,null,null,null,"加速",null,"最高",null,"巡航",null,"路上",null,"路外"]
["基本能力値",null,null,null,null,null,null,null,null,null,null,null,null,null,null,null,null,null,null,"コネクション",null,null,null,null,null,null,null,null,null,null,null,null,null,null,null,null,null,null,null,null,null,null,null,{"$f":"IF($AL$7=\"\",\"\",+VLOOKUP($AL$7,車両!$A$4:$K$14,2,FALSE))","v":""},null,{"$f":"IF($AL$7=\"\",\"\",+VLOOKUP($AL$7,車両!$A$4:$K$14,3,FALSE))","v":""},null,{"$f":"IF($AL$7=\"\",\"\",+VLOOKUP($AL$7,車両!$A$4:$K$14,4,FALSE))","v":""},null,{"$f":"IF($AL$7=\"\",\"\",+VLOOKUP($AL$7,車両!$A$4:$K$14,5,FALSE))","v":""},null,{"$f":"IF($AL$7=\"\",\"\",+VLOOKUP($AL$7,車両!$A$4:$K$14,6,FALSE))","v":""},null,{"$f":"IF($AL$7=\"\",\"\",+VLOOKUP($AL$7,車両!$A$4:$K$14,7,FALSE))","v":""},null,{"$f":"IF($AL$7=\"\",\"\",+VLOOKUP($AL$7,車両!$A$4:$K$14,8,FALSE))","v":""},null,null,null,{"$f":"IF($AL$7=\"\",\"\",+VLOOKUP($AL$7,車両!$A$4:$K$14,9,FALSE))","v":""},null,{"$f":"IF($AL$7=\"\",\"\",+VLOOKUP($AL$7,車両!$A$4:$K$14,10,FALSE))","v":""},null,{"$f":"IF($AL$7=\"\",\"\",+VLOOKUP($AL$7,車両!$A$4:$K$14,11,FALSE))","v":""},null,{"$f":"IF($AL$7=\"\",\"\",+VLOOKUP($AL$7,車両!$A$4:$S$14,12,FALSE))","v":""},null,{"$f":"IF($AL$7=\"\",\"\",+VLOOKUP($AL$7,車両!$A$4:$S$14,16,FALSE))","v":""},null,{"$f":"IF($AL$7=\"\",\"\",+VLOOKUP($AL$7,車両!$A$4:$S$14,17,FALSE))","v":""},null,null,{"$f":"IF($AL$7=\"\",\"\",+VLOOKUP($AL$7,車両!$A$4:$S$14,18,FALSE))","v":""}]
[null,null,null,"本来",null,"現在",null,"一時"]
["STR",null,null,null,null,null,null,null,null,null,null,null,null,null,null,null,null,null,null,"名前",null,null,null,null,null,null,null,"クラス/職業",null,null,null,"友好度",null,null,"CP",null,null,"損害の影響",null,null,null,null,null,null,null,null,null,null,null,null,null,null,null,"サイズ\n修正",null,"防御性能",null,null,null,null,null,"累積\nダメージ",null,null,"耐久点被ダメージ"]
[null,null,null,null,null,null,null,null,null,null,null,null,null,null,null,null,null,null,null,null,null,null,null,null,null,null,null,null,null,null,null,null,null,null,null,null,null,"程度",null,null,"累積損害",null,null,"損害修正",null,null,null,null,null,null,null,null,null,null,null,"装甲",null,"減衰",null,"耐久"]
["DEX",null,null,null,null,null,null,null,null,null,null,null,null,null,null,null,null,null,null,null,null,null,null,null,null,null,null,null,null,null,null,null,null,null,null,null,null,"中破",null,null,{"$f":"IF(AL7=\"\",\"\",ROUND(BH11/4,0))","v":""},null,null,{"$f":"IF(AO11=\"\",\"\",ROUND(AR7*0.8,0))","v":""},null,{"$f":"IF(AO11=\"\",\"\",ROUND(AT7*0.8,0))","v":""},null,{"$f":"IF(AO11=\"\",\"\",ROUND(AV7*0.8,0))","v":""},null,{"$f":"IF(AO11=\"\",\"\",AX7+1)","v":""},null,{"$f":"IF(AO11=\"\",\"\",AZ7+1)","v":""},null,{"$f":"IF($AL$7=\"\",\"\",+VLOOKUP($AL$7,車両!$A$4:$S$14,13,FALSE))","v":""},null,{"$f":"IF($AL$7=\"\",\"\",+VLOOKUP($AL$7,車両!$A$4:$S$14,14,FALSE))","v":""},null,{"$f":"IF($AL$7=\"\",\"\",+VLOOKUP($AL$7,車両!$A$4:$S$14,15,FALSE))","v":""},null,{"$f":"IF($AL$7=\"\",\"\",+VLOOKUP($AL$7,車両!$A$4:$S$14,16,FALSE))","v":""},null,{"$f":"IF(BM11=\"\",\"\",SUM(BM11:BU12))","v":""}]
[null,null,null,null,null,null,null,null,null,null,null,null,null,null,null,null,null,null,null,null,null,null,null,null,null,null,null,null,null,null,null,null,null,null,null,null,null,"大破",null,null,{"$f":"IF(AL7=\"\",\"\",ROUND(BH11*0.75,0))","v":""},null,null,{"$f":"IF(AO12=\"\",\"\",ROUND(AR7*0.5,0))","v":""},null,{"$f":"IF(AO12=\"\",\"\",ROUND(AT7*0.5,0))","v":""},null,{"$f":"IF(AO12=\"\",\"\",ROUND(AV7*0.5,0))","v":""},null,{"$f":"IF(AO12=\"\",\"\",AX7+2)","v":""},null,{"$f":"IF(AO12=\"\",\"\",AZ7+2)","v":""}]
["CON"]
[null,null,null,null,null,null,null,null,null,null,null,null,null,null,null,null,null,null,null,null,null,null,null,null,null,null,null,null,null,null,null,null,null,null,null,null,null,null,"相対速度",null,null,null,"目標\n修正"]
["INT",null,null,null,null,null,null,null,null,null,null,null,null,null,null,null,null,null,null,null,null,null,null,null,null,null,null,null,null,null,null,null,null,null,null,null,null,null,"同軸",null,"交錯"]
[null,null,null,null,null,null,null,null,null,null,null,null,null,null,null,null,null,null,null,null,null,null,null,null,null,null,null,null,null,null,null,null,null,null,null,null,null,null,30,null,10,null,"+1"]
["ENP",null,null,null,null,null,null,null,null,null,null,null,null,null,null,null,null,null,null,null,null,null,null,null,null,null,null,null,null,null,null,null,null,null,null,null,null,null,60,null,20,null,"+2"]
[null,null,null,null,null,null,null,null,null,null,null,null,null,null,null,null,null,null,null,null,null,null,null,null,null,null,null,null,null,null,null,null,null,null,null,null,null,null,90,null,30,null,"+3"]
["LIF",null,null,null,null,null,null,null,null,null,null,null,null,null,null,null,null,null,null,null,null,null,null,null,null,null,null,null,null,null,null,null,null,null,null,null,null,null,120,null,40,null,"+4"]
[null,null,null,null,null,null,null,null,null,null,null,null,null,null,null,null,null,null,null,null,null,null,null,null,null,null,null,null,null,null,null,null,null,null,null,null,null,null,150,null,50,null,"+5"]
{"$rows_left_out":43}
{"sheet":"武器","index":1,"n_rows":14,"n_cols":29,"rows_kept":14,"cut":false,"hidden":false,"merged":[[0,20,0,21]]}
["種類","貫通力","ダメージ","射撃数","速射値","照準限界","装弾数","近","中","遠","超遠","価格（TC)",null,"種類","貫通力","ダメージ","必要筋力","修正","価格（TC）",null,"近接戦闘ダメージ修正表",null,null,"種類","装甲度","間隙値","減衰値","DEX修正","価格"]
["小型リボルバー",4,"２Ｄ",1,1,2,6,10,30,50,null,1800,null,"小型ナイフ",2,"２Ｄ",6,-1,100,null,"STR","ダメージ修正",null,"防弾ベスト",0,2,10]
["大型リボルバー",6,"２Ｄ+1",1,1,2,6,10,30,50,null,2800,null,"大型ナイフ",2,"２Ｄ＋１",6,-1,180,null,1,-3,null,"レザージャケット",0,1,4]
["小型オートマチック",4,"２Ｄ",2,2,2,12,10,30,50,null,5800,null,"剣",2,"３Ｄ",8,-1,800,null,6,-2,null,"レザーコート",0,1,5]
["大型オートマチック",6,"２Ｄ+1",2,2,2,15,10,30,50,null,8500,null,"刀",3,"３Ｄ＋１",9,-1,2000,null,8,-1,null,"ライト・アーマー",9,2,6,null,1300]
["マシンピストル",4,"２Ｄ",6,3,1,25,15,50,80,null,12900,null,"手斧",3,"３Ｄ",8,-1,150,null,9,0,null,"ミディアム・アーマー",10,0,7,null,2500]
["サブマシンガン",6,"２Ｄ+1",6,4,1,30,20,60,100,null,17800,null,"両手斧",3,"３Ｄ＋１",10,-1,250,null,11,"+1",null,"ヘビー・アーマー",12,0,9,null,12000]
["アサルトライフル",7,"２Ｄ+2",6,6,3,35,25,80,150,300,23500,null,"打撃",0,"１Ｄ６","ＮＡ",0,null,null,13,"+2"]
["ライト・マシンガン",7,"２D+2",12,10,1,50,30,90,180,400,51600,null,"組み付く",0,"ＮＡ","ＮＡ","+2",null,null,15,"+3"]
["ヘビー・マシンガン",9,"３D",16,10,1,200,50,100,200,600,72000,null,"投げる",0,"1Ｄ６","ＮＡ","+2",null,null,18,"+4"]
["ライフル",7,"３Ｄ",2,1,4,10,30,100,200,500,11800,null,"関節技",0,"１Ｄ６＋1","ＮＡ","+3",null,null,21,"+7"]
["スナイパーライフル",8,"３Ｄ",2,1,6,8,50,150,300,600,39000,null,null,null,null,null,null,null,null,26,"+8"]
["対戦車ライフル",16,"３Ｄ＋２",1,1,3,6,50,100,200,500,54000,null,null,null,null,null,null,null,null,31,"+9"]
[null,null,null,null,null,null,null,null,null,null,null,null,null,null,null,null,null,null,null,null,41,"+10"]

{"sheet":"車両","index":2,"n_rows":15,"n_cols":41,"rows_kept":15,"cut":false,"hidden":false,"merged":[[1,17,2,17],[1,13,1,15],[1,6,2,6],[1,7,2,7],[1,9,2,9],[1,0,2,0],[1,4,1,5],[1,11,2,11],[1,8,2,8],[1,16,2,16],[1,1,1,3],[1,20,1,27],[1,12,2,12],[1,40,2,40],[0,29,0,40],[1,36,1,39],[1,29,2,29],[1,30,2,30],[1,31,2,31],[1,32,2,32],[1,33,2,33],[1,34,2,34],[1,35,2,35],[1,18,2,18],[0,0,0,19],[1,10,2,10],[1,19,2,19]]}
["車両一覧表",null,null,null,null,null,null,null,null,null,null,null,null,null,null,null,null,null,null,null,null,null,null,null,null,null,null,null,null,"車載火器"]
["種類","速度性能",null,null,"操縦修正",null,"燃費\nkm/l","燃料\n搭載量","積載\n容量","積載\n重量","搭乗員","乗員遮蔽","サイズ\n修正","装甲/耐久",null,null,"整備性","電子的\n脆弱性","自動｝\n操縦","価格(TC)","装備",null,null,null,null,null,null,null,null,"種類","貫通力","ダメージ","射撃数","速射値","照準限界","装弾数","射程",null,null,null,"価格"]
[null,"基本","最高","巡航","路上","路外",null,null,null,null,null,null,null,"装甲","減衰値","耐久",null,null,null,null,"射界","銃架/砲架","射界","銃架/砲架","射界","銃架/砲架","射界","銃架/砲架",null,null,null,null,null,null,null,null,"近","中","遠","超遠"]
["小型バギー",50,150,75,"0","+1",10,60,null,200,"3名",3,2,4,6,60,0,"NA","NA",70000,"なし","なし","なし","なし","なし","なし","なし","なし",null,"小口径無反動砲",24,"4D+20",1,1,3,1,50,200,400,600,45000]
["装甲バギー",40,120,60,"0","+1",8,90,null,200,"3名","NA",3,18,6,60,0,"NA","NA",100000,"FR90","簡易銃架","なし","なし","なし","なし","なし","なし",null,"大口径無反動砲",30,"5D+40",1,1,3,1,80,300,600,1000,60000]
["大型バギー",50,150,75,"0","+1",8,100,null,500,"4名",4,5,4,6,72,0,"NA","NA",100000,"なし","なし","なし","なし","なし","なし","なし","なし",null,"小口径機関砲",16,"4D+5",10,10,7,20,50,200,600,1000,80000]
["戦闘バギー",50,150,75,"0","+1",5,60,null,300,"4名",6,3,20,10,80,"+2","NA","NA",150000,"FR90","簡易銃架",360,"旋回銃架","なし","なし","なし","なし",null,"大口径機関砲",25,"5D+15",6,6,7,20,100,300,800,1200,120000]
["小型バン",30,90,45,"+1","+2",10,50,null,500,"2名",5,5,4,6,60,0,"NA","NA",80000,"なし","なし","なし","なし","なし","なし","なし","なし",null,"中口径戦車砲",30,"5D+50",1,1,8,1,100,500,1500,2000,120000]
["装甲バン",25,75,38,"+1","+2",6,60,null,400,"2名","NA",5,18,10,60,"+2","NA","NA",120000,"なし","なし","なし","なし","なし","なし","なし","なし",null,"大口径戦車砲",45,"8D+70",1,1,8,1,200,800,2000,3000,200000]
["レーシングバギー",70,280,140,"-1","+1",6,30,null,50,"2名",3,2,2,6,60,"+2","NA","NA",150000,"なし","なし","なし","なし","なし","なし","なし","なし",null,"対戦車誘導ミサイル",50,"10D+60",1,1,0,1,40,80,200,800,100000]
["小型トラック",30,90,45,"+1","+2",8,50,null,2000,"2名",5,6,4,6,72,0,"NA","NA",110000,"なし","なし","なし","なし","なし","なし","なし","なし",null,"ロケットランチャー",24,"6D+30",1,1,2,1,30,100,200,300,35000]
["大型トラック",30,90,45,"+1","+2",4,120,null,10000,"2名",5,7,4,8,88,0,"NA","NA",200000,"なし","なし","なし","なし","なし","なし","なし","なし",null,"ライト・マシンガン",7,"２D+2",12,10,1,50,30,90,180,400,51600]
["小型バイク",60,180,90,"-1","+2",18,12,null,60,"2名",1,1,0,6,40,0,"NA","NA",30000,"なし","なし","なし","なし","なし","なし","なし","なし",null,"ヘビー・マシンガン",9,"３D",16,10,1,200,50,100,200,600,72000]
["大型バイク",70,210,105,"-1","+2",10,20,null,100,"2名",1,1,0,6,48,0,"NA","NA",60000,"なし","なし","なし","なし","なし","なし","なし","なし"]
["オフロードバイク",60,160,80,0,"+1",14,12,null,70,"2名",1,1,0,6,42,0,"NA","NA",40000,"なし","なし","なし","なし","なし","なし","なし","なし"]